Reviews by

RSS

Test-Unit (0.24) *

This module fails to install on FreeBSD 4.9 with Perl 5.8.3.

It also fails to install on Slackware 9.0 with Perl 5.8.0, with an identical error.

It appears this module is being neglected. For example, there is a message on the perlunit-users mailing list (sourceforge.net/mailarchive/forum.php... reporting the same install problem back in 2002. No reply to that message has ever been posted; nor has the module been updated since then.

Here is the error:

Running make test
PERL_DL_NONLAZY=1 /usr/local/bin/perl5.8.3 "-MExtUtils::Command::MM" "-e" "test_harness(0, 'blib/lib', 'blib/arch')" t/*.t
t/all_tests.......ok
t/assert..........ok
t/try_examples....NOK 1# Test 1 got: 'Suite setup
# ..FSuite teardown
#
# TIME-SUMMARY
#
# !!!FAILURES!!!
# Test Results:
# Run: 2, Failures: 1, Errors: 0
#
# There was 1 failure:
# 1) examples/fail_example.pm:19 - test_fail(fail_example)
# Born to lose ...
#
# Test was not successful.
# ' (t/try_examples.t at line 103)
# Expected: 'Suite setup
# .F.Suite teardown
#
# TIME-SUMMARY
#
# !!!FAILURES!!!
# Test Results:
# Run: 2, Failures: 1, Errors: 0
#
# There was 1 failure:
# 1) examples/fail_example.pm:19 - test_fail(fail_example)
# Born to lose ...
#
# Test was not successful.
# '
# t/try_examples.t line 103 is: ok($out, $guru_checked{$e});
t/try_examples....FAILED test 1

Failed 1/4 tests, 75.00% okay
Failed Test Stat Wstat Total Fail Failed List of Failed
-------------------------------------------------------------------------------
t/try_examples.t 4 1 25.00% 1
Failed 1/3 test scripts, 66.67% okay. 1/83 subtests failed, 98.80% okay.
*** Error code 2

Stop in /root/.cpan/build/Test-Unit-0.24.

/usr/bin/make test -- NOT OK
Running make install

make test had returned bad status, won't install without force